New Paste

 

Recent Pastes

Administrate




Pastebin on paste.luisaranguren.com

PasteID: 7x
Pasted by Anonymous, 2017-02-09 23:26:48 GMT
Expires Never
Paste size 5.9 Kb
Tools Raw   Download
 
  1. DKMS make.log for amdgpu-pro-16.60-379184 for kernel 4.9.8-1-ARCH (x86_64) 
  2. Fri Feb 10 10:12:45 AEDT 2017 
  3. make: Entering directory '/usr/lib/modules/4.9.8-1-ARCH/build' 
  4.   LD      /var/lib/dkms/amdgpu-pro-16.60/379184/build/built-in.o 
  5.   LD      /var/lib/dkms/amdgpu-pro-16.60/379184/build/amd/amdkcl/built-in.o 
  6.   CC [M]  /var/lib/dkms/amdgpu-pro-16.60/379184/build/amd/amdkcl/kcl_drm.o 
  7.   LD      /var/lib/dkms/amdgpu-pro-16.60/379184/build/amd/amdgpu/built-in.o 
  8.   CC [M]  /var/lib/dkms/amdgpu-pro-16.60/379184/build/amd/amdgpu/amdgpu_drv.o 
  9.   LD      /var/lib/dkms/amdgpu-pro-16.60/379184/build/ttm/built-in.o 
  10.   CC [M]  /var/lib/dkms/amdgpu-pro-16.60/379184/build/ttm/ttm_memory.o 
  11.   CC [M]  /var/lib/dkms/amdgpu-pro-16.60/379184/build/ttm/ttm_tt.o 
  12. In file included from /var/lib/dkms/amdgpu-pro-16.60/379184/build/amd/amdgpu/../amdgpu/amdgpu_ttm.h:27:0, 
  13.                  from /var/lib/dkms/amdgpu-pro-16.60/379184/build/amd/amdgpu/../amdgpu/amdgpu.h:54, 
  14.                  from /var/lib/dkms/amdgpu-pro-16.60/379184/build/amd/amdgpu/../backport/include/kcl/kcl_amdgpu.h:5, 
  15.                  from /var/lib/dkms/amdgpu-pro-16.60/379184/build/amd/amdgpu/../backport/backport.h:5, 
  16.                  from <command-line>:0: 
  17. /var/lib/dkms/amdgpu-pro-16.60/379184/build/amd/amdgpu/../scheduler/gpu_scheduler.h:27:49: error: operator '==' has no left operand 
  18.  #if (defined OS_NAME_RHEL) && (OS_VERSION_MAJOR == 6) 
  19.                                                  ^~ 
  20. In file included from /var/lib/dkms/amdgpu-pro-16.60/379184/build/amd/amdgpu/../backport/backport.h:11:0, 
  21.                  from <command-line>:0: 
  22. /var/lib/dkms/amdgpu-pro-16.60/379184/build/include/kcl/kcl_acpi.h:8:49: error: operator '<=' has no left operand 
  23.  #if (defined OS_NAME_RHEL) && (OS_VERSION_MAJOR <= 6) 
  24.                                                  ^~ 
  25. In file included from /var/lib/dkms/amdgpu-pro-16.60/379184/build/amd/amdgpu/../backport/backport.h:12:0, 
  26.                  from <command-line>:0: 
  27. /var/lib/dkms/amdgpu-pro-16.60/379184/build/include/kcl/kcl_hwmon.h: In function ‘kcl_hwmon_device_register_with_groups’: 
  28. /var/lib/dkms/amdgpu-pro-16.60/379184/build/include/kcl/kcl_hwmon.h:15:49: error: operator '<=' has no left operand 
  29.  #if (defined OS_NAME_RHEL) && (OS_VERSION_MAJOR <= 6) 
  30.                                                  ^~ 
  31.   CC [M]  /var/lib/dkms/amdgpu-pro-16.60/379184/build/ttm/ttm_bo.o 
  32.   CC [M]  /var/lib/dkms/amdgpu-pro-16.60/379184/build/amd/amdkcl/kcl_fence.o 
  33.   CC [M]  /var/lib/dkms/amdgpu-pro-16.60/379184/build/amd/amdkcl/kcl_mn.o 
  34. make[2]: *** [scripts/Makefile.build:294: /var/lib/dkms/amdgpu-pro-16.60/379184/build/amd/amdgpu/amdgpu_drv.o] Error 1 
  35. make[2]: *** Waiting for unfinished jobs.... 
  36.   CC [M]  /var/lib/dkms/amdgpu-pro-16.60/379184/build/amd/amdgpu/amdgpu_device.o 
  37.   CC [M]  /var/lib/dkms/amdgpu-pro-16.60/379184/build/amd/amdkcl/kcl_fence_array.o 
  38.   CC [M]  /var/lib/dkms/amdgpu-pro-16.60/379184/build/amd/amdkcl/kcl_kthread.o 
  39. In file included from /var/lib/dkms/amdgpu-pro-16.60/379184/build/amd/amdgpu/../amdgpu/amdgpu_ttm.h:27:0, 
  40.                  from /var/lib/dkms/amdgpu-pro-16.60/379184/build/amd/amdgpu/../amdgpu/amdgpu.h:54, 
  41.                  from /var/lib/dkms/amdgpu-pro-16.60/379184/build/amd/amdgpu/../backport/include/kcl/kcl_amdgpu.h:5, 
  42.                  from /var/lib/dkms/amdgpu-pro-16.60/379184/build/amd/amdgpu/../backport/backport.h:5, 
  43.                  from <command-line>:0: 
  44. /var/lib/dkms/amdgpu-pro-16.60/379184/build/amd/amdgpu/../scheduler/gpu_scheduler.h:27:49: error: operator '==' has no left operand 
  45.  #if (defined OS_NAME_RHEL) && (OS_VERSION_MAJOR == 6) 
  46.                                                  ^~ 
  47. In file included from /var/lib/dkms/amdgpu-pro-16.60/379184/build/amd/amdgpu/../backport/backport.h:11:0, 
  48.                  from <command-line>:0: 
  49. /var/lib/dkms/amdgpu-pro-16.60/379184/build/include/kcl/kcl_acpi.h:8:49: error: operator '<=' has no left operand 
  50.  #if (defined OS_NAME_RHEL) && (OS_VERSION_MAJOR <= 6) 
  51.                                                  ^~ 
  52. In file included from /var/lib/dkms/amdgpu-pro-16.60/379184/build/amd/amdgpu/../backport/backport.h:12:0, 
  53.                  from <command-line>:0: 
  54. /var/lib/dkms/amdgpu-pro-16.60/379184/build/include/kcl/kcl_hwmon.h: In function ‘kcl_hwmon_device_register_with_groups’: 
  55. /var/lib/dkms/amdgpu-pro-16.60/379184/build/include/kcl/kcl_hwmon.h:15:49: error: operator '<=' has no left operand 
  56.  #if (defined OS_NAME_RHEL) && (OS_VERSION_MAJOR <= 6) 
  57.                                                  ^~ 
  58. make[2]: *** [scripts/Makefile.build:294: /var/lib/dkms/amdgpu-pro-16.60/379184/build/amd/amdgpu/amdgpu_device.o] Error 1 
  59. make[1]: *** [scripts/Makefile.build:544: /var/lib/dkms/amdgpu-pro-16.60/379184/build/amd/amdgpu] Error 2 
  60. make[1]: *** Waiting for unfinished jobs.... 
  61.   CC [M]  /var/lib/dkms/amdgpu-pro-16.60/379184/build/amd/amdkcl/kcl_reservation.o 
  62.   CC [M]  /var/lib/dkms/amdgpu-pro-16.60/379184/build/amd/amdkcl/symbols.o 
  63.   CC [M]  /var/lib/dkms/amdgpu-pro-16.60/379184/build/amd/amdkcl/main.o 
  64.   CC [M]  /var/lib/dkms/amdgpu-pro-16.60/379184/build/ttm/ttm_bo_util.o 
  65.   CC [M]  /var/lib/dkms/amdgpu-pro-16.60/379184/build/ttm/ttm_bo_vm.o 
  66.   CC [M]  /var/lib/dkms/amdgpu-pro-16.60/379184/build/ttm/ttm_module.o 
  67.   LD [M]  /var/lib/dkms/amdgpu-pro-16.60/379184/build/amd/amdkcl/amdkcl.o 
  68.   CC [M]  /var/lib/dkms/amdgpu-pro-16.60/379184/build/ttm/ttm_object.o 
  69.   CC [M]  /var/lib/dkms/amdgpu-pro-16.60/379184/build/ttm/ttm_lock.o 
  70.   CC [M]  /var/lib/dkms/amdgpu-pro-16.60/379184/build/ttm/ttm_execbuf_util.o 
  71.   CC [M]  /var/lib/dkms/amdgpu-pro-16.60/379184/build/ttm/ttm_page_alloc.o 
  72.   CC [M]  /var/lib/dkms/amdgpu-pro-16.60/379184/build/ttm/ttm_bo_manager.o 
  73.   CC [M]  /var/lib/dkms/amdgpu-pro-16.60/379184/build/ttm/ttm_page_alloc_dma.o 
  74.   CC [M]  /var/lib/dkms/amdgpu-pro-16.60/379184/build/ttm/ttm_agp_backend.o 
  75.   LD [M]  /var/lib/dkms/amdgpu-pro-16.60/379184/build/ttm/amdttm.o 
  76. make: *** [Makefile:1490: _module_/var/lib/dkms/amdgpu-pro-16.60/379184/build] Error 2 
  77. make: Leaving directory '/usr/lib/modules/4.9.8-1-ARCH/build' 
  78.  
 
 
 
 
Written by Xan Manning, 2010.