New Paste

 

Recent Pastes

Administrate




Pastebin on paste.luisaranguren.com

PasteID: 1kx
Pasted by Anonymous, 2019-01-10 23:52:54 GMT
Expires Never
Paste size 14.58 Kb
Tools Raw   Download
 
  1. npm install                                                                                                                                                                                                                                                                                                                                          [404/1045]  
  2.                                                                                                                                                                                                                                                                                                                                                                                              
  3. > grpc@1.15.1 install /root/lnd-explorer/node_modules/grpc                                                                                                                                                                                                                                                                                                                                   
  4. > node-pre-gyp install --fallback-to-build --library=static_library                                                                                                                                                                                                                                                                                                                          
  5.                                                                                                                                                                                                                                                                                                                                                                                              
  6. node-pre-gyp WARN Using request for node-pre-gyp https download                                                                                                                                                                                                                                                                                                                              
  7. node-pre-gyp WARN Tried to download(404): https://node-precompiled-binaries.grpc.io/grpc/v1.15.1/node-v67-linux-x64-glibc.tar.gz  
  8. node-pre-gyp WARN Pre-built binaries not found for grpc@1.15.1 and node@11.6.0 (node-v67 ABI, glibc) (falling back to source compile with node-gyp)                                                                                                                                                                                                                                          
  9. node-pre-gyp WARN Pre-built binaries not installable for grpc@1.15.1 and node@11.6.0 (node-v67 ABI, glibc) (falling back to source compile with node-gyp)                                                                                                                                                                                                                                    
  10. node-pre-gyp WARN Hit error Connection closed while downloading tarball file  
  11. make: Entering directory '/root/lnd-explorer/node_modules/grpc/build'  
  12.   CXX(target) Release/obj.target/grpc/deps/grpc/src/core/lib/surface/init.o  
  13. make: Entering directory '/root/lnd-explorer/node_modules/grpc/build'                                                                                                                                                                                                                                                                                                                        
  14.   CXX(target) Release/obj.target/grpc/deps/grpc/src/core/lib/surface/init.o                                                                                                                                                                                                                                                                                                                  
  15. rm: cannot remove './Release/.deps/Release/obj.target/grpc/deps/grpc/src/core/lib/surface/init.o.d.raw': No such file or directory                                                                                                                                                                                                                                                           
  16. make: *** [grpc.target.mk:469: Release/obj.target/grpc/deps/grpc/src/core/lib/surface/init.o] Error 1                                                                                                                                                                                                                                                                                        
  17. make: Leaving directory '/root/lnd-explorer/node_modules/grpc/build'                                                                                                                                                                                                                                                                                                                         
  18. gyp ERR! build error  
  19. gyp ERR! stack Error: `make` failed with exit code: 2                                                                                                                                                                                                                                                                                                                                        
  20. gyp ERR! stack     at ChildProcess.onExit (/usr/lib/node_modules/node-gyp/lib/build.js:262:23)                                                                                                                                                                                                                                                                                               
  21. gyp ERR! stack     at ChildProcess.emit (events.js:188:13)  
  22. gyp ERR! stack     at Process.ChildProcess._handle.onexit (internal/child_process.js:254:12)  
  23. gyp ERR! System Linux 4.18.5-arch1-1-ARCH  
  24. gyp ERR! command "/usr/bin/node" "/usr/lib/node_modules/node-gyp/bin/node-gyp.js" "build" "--fallback-to-build" "--library=static_library" "--module=/root/lnd-explorer/node_modules/grpc/src/node/extension_binary/node-v67-linux-x64-glibc/grpc_node.node" "--module_name=grpc_node" "--module_path=/root/lnd-explorer/node_modules/grpc/src/node/extension_binary/node-v67-linux-x64-glib  
  25. c" "--napi_version=3" "--node_abi_napi=napi"                                                                                                                                                                                                                                                                                                                                                 
  26. gyp ERR! cwd /root/lnd-explorer/node_modules/grpc                                                                                                                                                                                                                                                                                                                                            
  27. gyp ERR! node -v v11.6.0                                                                                                                                                                                                                                                                                                                                                                     
  28. gyp ERR! node-gyp -v v3.8.0                                                                                                                                                                                                                                                                                                                                                                  
  29. gyp ERR! not ok  
  30. node-pre-gyp ERR! build error                                                                                                                                                                                                                                                                                                                                                                
  31. node-pre-gyp ERR! stack Error: Failed to execute '/usr/bin/node /usr/lib/node_modules/node-gyp/bin/node-gyp.js build --fallback-to-build --library=static_library --module=/root/lnd-explorer/node_modules/grpc/src/node/extension_binary/node-v67-linux-x64-glibc/grpc_node.node --module_name=grpc_node --module_path=/root/lnd-explorer/node_modules/grpc/src/node/extension_binary/node-  
  32. v67-linux-x64-glibc --napi_version=3 --node_abi_napi=napi' (1)  
  33. node-pre-gyp ERR! stack     at ChildProcess.<anonymous> (/root/lnd-explorer/node_modules/grpc/node_modules/node-pre-gyp/lib/util/compile.js:83:29)                                                                                                                                                                                                                                           
  34. node-pre-gyp ERR! stack     at ChildProcess.emit (events.js:188:13)                                                                                                                                                                                                                                                                                                                          
  35. node-pre-gyp ERR! stack     at maybeClose (internal/child_process.js:978:16)  
  36. node-pre-gyp ERR! stack     at Process.ChildProcess._handle.onexit (internal/child_process.js:265:5)                                                                                                                                                                                                                                                                                         
  37. node-pre-gyp ERR! System Linux 4.18.5-arch1-1-ARCH                                                                                                                                                                                                                                                                                                                                           
  38. node-pre-gyp ERR! command "/usr/bin/node" "/root/lnd-explorer/node_modules/grpc/node_modules/.bin/node-pre-gyp" "install" "--fallback-to-build" "--library=static_library"                                                                                                                                                                                                                   
  39. node-pre-gyp ERR! cwd /root/lnd-explorer/node_modules/grpc                                                                                                                                                                                                                                                                                                                                   
  40. node-pre-gyp ERR! node -v v11.6.0  
  41. node-pre-gyp ERR! node-pre-gyp -v v0.10.3  
  42. node-pre-gyp ERR! not ok  
  43. Failed to execute '/usr/bin/node /usr/lib/node_modules/node-gyp/bin/node-gyp.js build --fallback-to-build --library=static_library --module=/root/lnd-explorer/node_modules/grpc/src/node/extension_binary/node-v67-linux-x64-glibc/grpc_node.node --module_name=grpc_node --module_path=/root/lnd-explorer/node_modules/grpc/src/node/extension_binary/node-v67-linux-x64-glibc --napi_vers  
  44. ion=3 --node_abi_napi=napi' (1)  
  45.   CXX(target) Release/obj.target/grpc/deps/grpc/src/core/lib/avl/avl.o  
  46. npm WARN bootstrap@4.1.3 requires a peer of jquery@1.9.1 - 3 but none is installed. You must install peer dependencies yourself.  
  47. npm WARN react-entypo@1.3.0 requires a peer of react@15.x.x but none is installed. You must install peer dependencies yourself.  
  48. npm WARN react-entypo@1.3.0 requires a peer of react-dom@15.x.x but none is installed. You must install peer dependencies yourself.  
  49. npm WARN optional SKIPPING OPTIONAL DEPENDENCY: fsevents@1.1.3 (node_modules/fsevents):  
  50. npm WARN notsup SKIPPING OPTIONAL DEPENDENCY: Unsupported platform for fsevents@1.1.3: wanted {"os":"darwin","arch":"any"} (current: {"os":"linux","arch":"x64"})  
  51. npm WARN optional SKIPPING OPTIONAL DEPENDENCY: fsevents@1.2.4 (node_modules/chokidar/node_modules/fsevents):  
  52. npm WARN notsup SKIPPING OPTIONAL DEPENDENCY: Unsupported platform for fsevents@1.2.4: wanted {"os":"darwin","arch":"any"} (current: {"os":"linux","arch":"x64"})  
  53.   
  54. npm ERR! code ELIFECYCLE  
  55. npm ERR! errno 1  
  56. npm ERR! grpc@1.15.1 install: `node-pre-gyp install --fallback-to-build --library=static_library`  
  57. npm ERR! Exit status 1  
  58. npm ERR!  
  59. npm ERR! Failed at the grpc@1.15.1 install script.  
  60. npm ERR! This is probably not a problem with npm. There is likely additional logging output above.  
  61.   
  62. npm ERR! A complete log of this run can be found in:  
  63. npm ERR!     /root/.npm/_logs/2019-01-10T19_31_27_054Z-debug.log  
  64. [root@testnet lnd-explorer]# ../deps/grpc/src/core/lib/avl/avl.cc:306:67: fatal error: opening dependency file ./Release/.deps/Release/obj.target/grpc/deps/grpc/src/core/lib/avl/avl.o.d.raw: No such file or directory                                                                                                                                                                     
  65. compilation terminated.  
  66. make: *** [grpc.target.mk:469: Release/obj.target/grpc/deps/grpc/src/core/lib/avl/avl.o] Error 1  
  67. make: Leaving directory '/root/lnd-explorer/node_modules/grpc/build'  
  68. gyp ERR! build error  
  69. gyp ERR! stack Error: `make` failed with exit code: 2  
  70. gyp ERR! stack     at ChildProcess.onExit (/usr/lib/node_modules/node-gyp/lib/build.js:262:23)  
  71. gyp ERR! stack     at ChildProcess.emit (events.js:188:13)  
  72. gyp ERR! stack     at Process.ChildProcess._handle.onexit (internal/child_process.js:254:12)  
  73. gyp ERR! System Linux 4.18.5-arch1-1-ARCH  
  74. gyp ERR! command "/usr/bin/node" "/usr/lib/node_modules/node-gyp/bin/node-gyp.js" "build" "--fallback-to-build" "--library=static_library" "--module=/root/lnd-explorer/node_modules/grpc/src/node/extension_binary/node-v67-linux-x64-glibc/grpc_node.node" "--module_name=grpc_node" "--module_path=/root/lnd-explorer/node_modules/grpc/src/node/extension_binary/node-v67-linux-x64-glib  
  75. c" "--napi_version=3" "--node_abi_napi=napi"  
  76. gyp ERR! cwd /root/lnd-explorer/node_modules/grpc  
  77. gyp ERR! node -v v11.6.0  
  78. gyp ERR! node-gyp -v v3.8.0  
  79. gyp ERR! not ok  
  80.   
  81.  
 
 
 
 
Written by Xan Manning, 2010.